{"text_format":"1","workbook":"xlsx","n_sheets":16,"sheets":["Notice explication","licences","3. Declaration sur l'honneur","1. Présentation Association"," Tresorerie","journal","2. Budget Général","1.1 Fonctionnement","1.2 budget Fonct","2.1 Sub Exceptionnelle","2.2 budget Sub Except","3.2budget activité 3","4.2budget  activité 4","5.2budget activité 5","validation liste","Feuil1"],"not_rendered":{"charts":0,"images":2,"macros":1,"external_links":1,"defined_names":221,"comments":5,"pivot_tables":0},"unopened":[],"bounds":{"document_bytes":16777216,"sheet_cells":100000,"rows_first":2000,"rows_last":500,"rows_between":2000,"halvings":0,"cell_chars":16384,"cell_head_chars":4096},"cells_cut":0,"cells_raw":0,"read":"whole","date_system":"1900"}

{"sheet":"Notice explication","index":0,"n_rows":34,"n_cols":1,"rows_kept":34,"cut":false,"hidden":false,"merged":[]}
["NOTICE POUR REMPLIR LA DEMANDE DE SUBVENTION"]
["TOUTES LES CELLULES \"VERTES\" DOIVENT ETRE RENSEIGNEES \nLES FICHIERS SONT LIES ENTRE EUX POUR VOUS FACILITER LE TRAVAIL"]
[]
["Ce dossier doit être utilisé par les associations sportives sollicitant une subvention auprès de la commune de Saint-Pierre d’Oléron. Il concerne le financement d’actions spécifiques ou le fonctionnement général de l’association."]
[]
["(Document à Imprimer)"]
["Fiche n°1  : Présentation de l’association. "]
[]
["Pour bénéficier d’une subvention, vous devez disposer :"]
["·         D’un numéro SIRET"]
{"$rows_left_out":25}
{"sheet":"licences","index":1,"n_rows":400,"n_cols":25,"rows_kept":400,"cut":false,"hidden":false,"merged":[[0,0,2,4],[0,19,2,24],[2,17,2,18],[0,16,1,18],[1,13,1,14],[0,13,0,15]]}
[null,null,null,null,null,"TOTAL "]
[null,null,null,null,null,"ADHERENTS",null,null,null,null,null,null,null,"Montant Total reversé",null,{"$f":"N4+O4+P4","v":0}]
[null,null,null,null,null,{"$f":"G3+H3","v":0},{"$f":"SUM(G5:G397)","v":0},{"$f":"SUM(H5:H397)","v":0},{"$f":"SUM(I5:I397)","v":0},null,"Total Reçu\nMontant\nLicence","Equipement Spécifique","Total Perçu ","Total\nCotisation\n Fédération","Total\nCotisation\nLigue","Total\nCotisation\n Comité","Total\nrestant au Club","Téléphone"]
["Ligne","Date Inscription"," Prénom","Nom","Date Naissance","Commune","+18 ans","- 18 ans","Dirigeant","Categorie",{"$f":"SUM(K5:K397)","v":0},{"$f":"SUM(L5:L397)","v":0},{"$f":"SUM(M5:M400)","v":0},{"$f":"SUM(N5:N397)","v":0},0,0,0," Fixe","Mobile","Adresse Postal","Adresse E-Mail","Observations","Autre",null,"Autre"]
[1,null,null,null,null,null,null,null,null,null,null,null,{"$f":"L5+K5","v":0},null,null,null,{"$f":"(K5+L5)-(N5+O5+P5)","v":0}]
[2,null,null,null,null,null,null,null,null,null,null,null,{"$f":"L6+K6","v":0},null,null,null,{"$f":"(K6+L6)-(N6+O6+P6)","v":0}]
[3,null,null,null,null,null,null,null,null,null,null,null,0,null,null,null,0]
[4,null,null,null,null,null,null,null,null,null,null,null,0,null,null,null,0]
[5,null,null,null,null,null,null,null,null,null,null,null,{"$f":"L9+K9","v":0},null,null,null,0]
[6,null,null,null,null,null,null,null,null,null,null,null,0,null,null,null,0]
{"$rows_left_out":391}
{"sheet":"3. Declaration sur l'honneur","index":2,"n_rows":49,"n_cols":16,"rows_kept":49,"cut":false,"hidden":false,"merged":[[32,2,32,25],[26,12,26,21],[48,21,48,25],[46,15,46,25],[28,1,28,26],[42,0,42,1],[44,0,44,1],[36,0,36,1],[36,2,36,25],[37,0,38,1],[37,15,38,20],[39,0,40,1],[39,15,40,23],[34,0,34,1],[34,2,34,25],[30,0,30,25],[32,0,32,1],[1,0,1,25],[2,0,2,26],[4,0,4,25],[7,0,7,1],[7,2,7,21],[25,22,25,26],[25,2,25,11],[25,12,25,21],[26,22,26,26],[5,0,5,25],[9,0,9,7],[13,0,13,1],[23,0,23,10],[23,11,23,17],[11,0,11,2],[11,4,11,21],[9,8,9,21],[20,2,20,3],[22,2,22,3],[26,0,26,1],[26,2,26,11]]}
[]
["4. DÉCLARATIONS SUR L'HONNEUR"]
["(Document à imprimer)"]
[]
["Si le signataire n’est pas le représentant légal de l’association, merci de joindre"]
["le pouvoir lui permettant d’engager celle-ci "]
[]
["Je soussigné (e)"]
[]
["Représentant légal de l’association:"]
{"$rows_left_out":40}
{"sheet":"1. Présentation Association","index":3,"n_rows":111,"n_cols":7,"rows_kept":111,"cut":false,"hidden":false,"merged":[[86,4,86,5],[58,4,58,6],[68,1,68,2],[69,1,69,2],[62,1,62,4],[58,2,58,3],[61,1,61,4],[41,1,41,3],[51,2,51,5],[39,1,39,3],[37,5,37,6],[56,2,56,3],[56,4,56,6],[1,2,1,5],[3,2,3,5],[6,1,6,6],[28,3,28,6],[24,3,24,6],[10,3,10,5],[22,2,22,3],[12,3,12,5],[26,4,26,6],[10,1,10,2],[14,2,14,5],[16,2,16,5],[20,5,20,6],[18,2,18,5],[5,1,5,4],[33,5,33,6],[32,5,32,6],[110,4,112,5],[77,1,77,2],[70,1,70,2],[82,1,82,2],[83,1,83,2],[88,1,88,3],[80,3,80,5],[108,4,108,5],[75,1,75,2],[76,1,76,2],[88,4,88,6],[86,1,86,2],[48,1,48,4],[35,5,35,6]]}
[]
[null,null,"1-1. Présentation de l'association"]
[]
[null,null,"St Pierre d'Oléron"]
[]
[null,"Formulaire à compléter et à adresser à l' OMS  avant le :"]
[null,"Après vérification (dossier complet), celui-ci est transmis  au service concerné."]
[]
[null,"I. Identification :"]
[]
{"$rows_left_out":102}
{"sheet":" Tresorerie","index":4,"n_rows":22,"n_cols":6,"rows_kept":22,"cut":false,"hidden":false,"merged":[[10,1,11,1],[10,2,11,2],[10,5,11,5],[1,1,1,5],[4,5,5,5],[7,1,8,1],[7,5,8,5],[7,2,8,2],[4,1,5,1],[4,2,5,2],[23,1,23,5],[16,1,17,1],[16,5,17,5],[22,1,22,5],[13,1,14,1],[13,5,14,5],[13,2,14,2],[16,2,17,2],[20,1,20,2],[21,1,21,2]]}
[]
[]
[null,"NOM de la BANQUE","FIN d' EXERCICE",null,"Mouvements","DEBUT d' EXERCICE "]
[null,"Compte N°1"]
[null,"cm",{"$f":"F5+E5-E6","v":0},"CREDIT",{"$f":"SUMIFS(journal!J5:J982,journal!M5:M982,\"Compte N°1\")","v":0}]
[null,null,null,"DEBIT",{"$f":"SUMIFS(journal!I5:I982,journal!M5:M982,\"Compte N°1\")","v":0}]
[null,"Compte N°2"]
[null,null,{"$f":"F8+E8-E9","v":0},"CREDIT",{"$f":"SUMIFS(journal!J5:J982,journal!M5:M982,\"Compte N°2\")","v":0}]
[null,null,null,"DEBIT",{"$f":"SUMIFS(journal!I5:I982,journal!M5:M982,\"Compte N°2\")","v":0}]
[null,"Livret N°1"]
{"$rows_left_out":13}
{"sheet":"journal","index":5,"n_rows":986,"n_cols":17,"rows_kept":986,"cut":false,"hidden":false,"merged":[[1,4,2,6],[1,2,2,3],[1,10,2,15]]}
[]
[null,null,"ASSOCIATION :",null,null,null,null,null,"Total Dépenses","Total Recettes","LIVRE DE COMPTE"]
[null,null,null,null,null,null,null,null,{"$f":"SUM(I5:I986)-'2. Budget Général'!D53","v":0},{"$f":"SUM(J5:J986)-'2. Budget Général'!I53","v":0}]
["Ligne","Date","N° FACT","LIBELLE ","DEPENSES   (Liste Déroulante)",null,"RECETTES  (Liste Déroulante)",null,"DEPENSES","RECETTES","Code\nDepense","Code \nrecette","Compte \nBanque","N° Chèque","Actions","Pointage\nMettre ( x )","Observations"]
[1,null,null,null,null,"Eau - Energies - EDF/GDF",null,"Ventes produits finis",null,null,{"$f":"IF(E5=$F$5,6061,IF(E5=$F$6,6063,IF(E5=$F$7,6064,IF(E5=$F$8,607,IF(E5=$F$9,608,IF(E5=$F$12,613,IF(E5=$F$13,615,IF(E5=$F$14,616,IF(E5=$F$15,618,IF(E5=$F$19,621,IF(E5=$F$20,622,IF(E5=$F$21,623,IF(E5=$F$22,6251,IF(E5=$F$23,6256,IF(E5=$F$24,6257,IF(E5=$F$25,626,IF(E5=$F$26,627,IF(E5=$F$27,628,IF(E5=$F$26,627,IF(E5=$F$27,628,IF(E5=$F$29,63,IF(E5=$F$31,641,IF(E5=$F$32,645,IF(E5=$F$33,647,IF(E5=$F$34,648,IF(E5=$F$36,658,IF(E5=$F$37,6586,IF(E5=$F$38,65861,IF(E5=$F$39,65862,IF(E5=$F$40,65863,IF(E5=$F$41,65864,IF(E5=$F$42,65865,IF(E5=$F$45,66,IF(E5=$F$46,67,IF(E5=$F$47,68,IF(E5=$F$50,860,IF(E5=$F$51,861,IF(E5=$F$52,862,IF(E5=$F$53,864,IF(E5=$F$9,608,\"\"))))))))))))))))))))))))))))))))))))))))","v":""},{"$f":"IF(G5=$H$5,701,IF(G5=$H$6,706,IF(G5=$H$7,707,IF(G5=$H$8,708,IF(G5=$H$12,7401,IF(G5=$H$13,7402,IF(G5=$H$14,7403,IF(G5=$H$15,7404,IF(G5=$H$16,7405,IF(G5=$H$17,7406,IF(G5=$H$18,7407,IF(G5=$H$19,7408,IF(G5=$H$20,7409,IF(G5=$H$21,74010,IF(G5=$H$22,74011,IF(G5=$H$23,74012,IF(G5=$H$24,74013,IF(G5=$H$27,754,IF(G5=$H$28,756,IF(G5=$H$29,758,IF(G5=$H$33,7681,IF(G5=$H$38,77,IF(G5=$H$39,78,IF(G5=$H$42,870,IF(G5=$H$43,871,IF(G5=$H$44,875,\"\"))))))))))))))))))))))))))","v":""}]
[2,null,null,null,null,"Fournitures Ent. et Petit équipt ",null,"Prestations de services",null,null,{"$f":"IF(E6=$F$5,6061,IF(E6=$F$6,6063,IF(E6=$F$7,6064,IF(E6=$F$8,607,IF(E6=$F$9,608,IF(E6=$F$12,613,IF(E6=$F$13,615,IF(E6=$F$14,616,IF(E6=$F$15,618,IF(E6=$F$19,621,IF(E6=$F$20,622,IF(E6=$F$21,623,IF(E6=$F$22,6251,IF(E6=$F$23,6256,IF(E6=$F$24,6257,IF(E6=$F$25,626,IF(E6=$F$26,627,IF(E6=$F$27,628,IF(E6=$F$26,627,IF(E6=$F$27,628,IF(E6=$F$29,63,IF(E6=$F$31,641,IF(E6=$F$32,645,IF(E6=$F$33,647,IF(E6=$F$34,648,IF(E6=$F$36,658,IF(E6=$F$37,6586,IF(E6=$F$38,65861,IF(E6=$F$39,65862,IF(E6=$F$40,65863,IF(E6=$F$41,65864,IF(E6=$F$42,65865,IF(E6=$F$45,66,IF(E6=$F$46,67,IF(E6=$F$47,68,IF(E6=$F$50,860,IF(E6=$F$51,861,IF(E6=$F$52,862,IF(E6=$F$53,864,IF(E6=$F$9,608,\"\"))))))))))))))))))))))))))))))))))))))))","v":""},{"$f":"IF(G6=$H$5,701,IF(G6=$H$6,706,IF(G6=$H$7,707,IF(G6=$H$8,708,IF(G6=$H$12,7401,IF(G6=$H$13,7402,IF(G6=$H$14,7403,IF(G6=$H$15,7404,IF(G6=$H$16,7405,IF(G6=$H$17,7406,IF(G6=$H$18,7407,IF(G6=$H$19,7408,IF(G6=$H$20,7409,IF(G6=$H$21,74010,IF(G6=$H$22,74011,IF(G6=$H$23,74012,IF(G6=$H$24,74013,IF(G6=$H$27,754,IF(G6=$H$28,756,IF(G6=$H$29,758,IF(G6=$H$33,7681,IF(G6=$H$38,77,IF(G6=$H$39,78,IF(G6=$H$42,870,IF(G6=$H$43,871,IF(G6=$H$44,875,\"\"))))))))))))))))))))))))))","v":""}]
[3,null,null,null,null,"Fournitures administratives",null,"Ventes de marchandises ",null,null,"",""]
[4,null,null,null,null,"Achats marchandises ",null,"Produits des activités annexes ",null,null,"",""]
[5,null,null,null,null,"Achats Matériel",null,null,null,null,"",""]
[6,null,null,null,null,null,null,null,null,null,"",""]
{"$rows_left_out":977}
{"sheet":"2. Budget Général","index":6,"n_rows":66,"n_cols":9,"rows_kept":66,"cut":false,"hidden":false,"merged":[[0,1,0,8],[70,1,70,3],[57,5,57,6],[3,3,3,6],[48,5,48,6],[50,5,50,6],[51,0,51,8],[2,3,2,7],[59,1,59,2],[59,6,59,7]]}
[null,"5 - Bilan financier (Compte de Résultat) "]
[]
[null,"Association : ",null,null,null,null,null,null,2016]
[]
["Code","CHARGES","Prévisionnel\nFonct / Except \n","Réalisé\nFonct / Except \n\n",null,"Code","PRODUITS","Prévisionnel\nFonct / Except \n","Réalisé\nFonct / Except \n\n"]
[60,"Achats",{"$f":"SUM(C7:C12)","v":0},{"$f":"SUM(D7:D12)","v":0},null,70,"Ventes de produits et services",{"$f":"SUM(H7:H12)","v":0},{"$f":"SUM(I7:I12)","v":0}]
[6061,"Eau - Energies - EDF/GDF",{"$f":"'1.2 budget Fonct'!D7+'2.2 budget Sub Except'!D7","v":0},{"$f":"SUMIF(journal!K5:K986,A7,journal!I5:I986)","v":0},null,701,"Ventes produits finis ",{"$f":"'1.2 budget Fonct'!H7+'2.2 budget Sub Except'!H7","v":0},{"$f":"SUMIF(journal!$L$5:$L$987,F7,journal!$J$5:$J$987)","v":0}]
[6063,"Fournitures Ent. / Petit équipt ",{"$f":"'1.2 budget Fonct'!D8+'2.2 budget Sub Except'!D8","v":0},{"$f":"SUMIF(journal!K5:K986,A8,journal!I5:I986)","v":0},null,706,"Prestations de services ",{"$f":"'1.2 budget Fonct'!H8+'2.2 budget Sub Except'!H8","v":0},{"$f":"SUMIF(journal!$L$5:$L$987,F8,journal!$J$5:$J$987)","v":0}]
[6064,"Fournitures administratives",{"$f":"'1.2 budget Fonct'!D9+'2.2 budget Sub Except'!D9","v":0},{"$f":"SUMIF(journal!K5:K986,A9,journal!I5:I986)","v":0},null,707,"Ventes de marchandises ",{"$f":"'1.2 budget Fonct'!H9+'2.2 budget Sub Except'!H9","v":0},{"$f":"SUMIF(journal!$L$5:$L$987,F9,journal!$J$5:$J$987)","v":0}]
[607,"Achats marchandises ",{"$f":"'1.2 budget Fonct'!D10+'2.2 budget Sub Except'!D10","v":0},{"$f":"SUMIF(journal!K5:K986,A10,journal!I5:I986)","v":0},null,708,"Produits des activités annexes ",{"$f":"'1.2 budget Fonct'!H10+'2.2 budget Sub Except'!H10","v":0},{"$f":"SUMIF(journal!$L$5:$L$987,F10,journal!$J$5:$J$987)","v":0}]
{"$rows_left_out":57}
{"sheet":"1.1 Fonctionnement","index":7,"n_rows":44,"n_cols":7,"rows_kept":44,"cut":false,"hidden":false,"merged":[[4,1,4,6],[0,2,0,5],[1,2,1,5],[43,5,43,6],[26,2,26,5],[13,2,13,6],[16,2,16,6],[24,2,24,5],[6,2,6,6],[41,5,41,6],[33,2,33,4],[30,4,30,5],[20,2,20,3],[3,2,3,5],[38,1,38,7],[8,2,8,6],[34,1,34,6],[18,2,18,6],[22,2,22,5],[28,2,28,5],[9,3,9,5]]}
[null,null,"Nom de la Commune"]
[null,null,"St Pierre d'Oléron"]
[]
[null,null,"1.1 -   FICHE  N° 1 "]
[null,"SUBVENTION de FONCTIONNEMENT"]
[]
[null,"NOM de l' Association"]
[]
[null,"  Si \"Autre\" à préciser ICI : "]
[null,"Nbre d'adhérent à l'Asssociation",{"$f":"licences!F3","v":0}]
{"$rows_left_out":35}
{"sheet":"1.2 budget Fonct","index":8,"n_rows":60,"n_cols":9,"rows_kept":60,"cut":false,"hidden":false,"merged":[[58,7,59,8],[50,2,50,8],[0,0,0,8],[1,3,1,6],[2,2,2,3],[3,1,3,8],[58,2,58,6],[2,4,2,6]]}
["1.2 - BUDGET PREVISIONNEL de FONCTIONNEMENT"]
[null,null,"Association : ",null,null,null,null,2017]
[null,null,"Si \"Autre\" à préciser ICI :"]
[]
[null,"Code","CHARGES","Prévisionnel\nFonct","\nRéalisé\nFonct\n","Code","PRODUITS","Prévisionnel\nFonct","\nRéalisé\nFonct\n"]
[null,60,"Achats",{"$f":"SUM(D7:D12)","v":0},{"$f":"SUM(E7:E12)","v":0},70,"Ventes de produits et services",{"$f":"SUM(H7:H12)","v":0},{"$f":"SUM(I7:I12)","v":0}]
[null,6061,"Eau - Energies - EDF/GDF",null,{"$f":"SUMIFS(journal!$I$5:$I$986,journal!$K$5:$K$986,'2. Budget Général'!A7,journal!$O$5:$O$986,\"FONCT\")","v":0},701,"Ventes produits finis ",null,{"$f":"SUMIFS(journal!$J$5:$J$986,journal!$L$5:$L$986,'2. Budget Général'!F7,journal!$O$5:$O$986,\"FONCT\")","v":0}]
[null,6063,"Fournitures Ent. / Petit équipt ",null,{"$f":"SUMIFS(journal!$I$5:$I$986,journal!$K$5:$K$986,'2. Budget Général'!A8,journal!$O$5:$O$986,\"FONCT\")","v":0},706,"Prestations de services ",null,{"$f":"SUMIFS(journal!$J$5:$J$986,journal!$L$5:$L$986,'2. Budget Général'!F8,journal!$O$5:$O$986,\"FONCT\")","v":0}]
[null,6064,"Fournitures administratives",null,{"$f":"SUMIFS(journal!$I$5:$I$986,journal!$K$5:$K$986,'2. Budget Général'!A9,journal!$O$5:$O$986,\"FONCT\")","v":0},707,"Ventes de marchandises ",null,{"$f":"SUMIFS(journal!$J$5:$J$986,journal!$L$5:$L$986,'2. Budget Général'!F9,journal!$O$5:$O$986,\"FONCT\")","v":0}]
[null,607,"Achats marchandises ",null,{"$f":"SUMIFS(journal!$I$5:$I$986,journal!$K$5:$K$986,'2. Budget Général'!A10,journal!$O$5:$O$986,\"FONCT\")","v":0},708,"Produits des activités annexes ",null,{"$f":"SUMIFS(journal!$J$5:$J$986,journal!$L$5:$L$986,'2. Budget Général'!F10,journal!$O$5:$O$986,\"FONCT\")","v":0}]
{"$rows_left_out":51}
{"sheet":"2.1 Sub Exceptionnelle","index":9,"n_rows":48,"n_cols":7,"rows_kept":48,"cut":false,"hidden":false,"merged":[[0,2,0,5],[1,2,1,5],[22,2,22,6],[12,2,12,6],[14,2,14,6],[16,2,16,6],[18,2,18,6],[20,2,20,6],[42,1,42,7],[45,5,45,6],[47,5,49,6],[26,2,26,5],[28,2,28,5],[30,2,30,5],[34,4,34,5],[37,2,37,4],[38,1,38,6],[32,2,32,5],[24,2,24,3],[3,2,3,5],[7,2,7,6],[9,2,9,6],[4,1,4,6],[5,2,5,6]]}
[null,null,"Nom de la Commune"]
[null,null,"St Pierre d'Oléron"]
[]
[null,null,"2.1 -   FICHE  N° 2"]
[null," SUBVENTION  EXCEPTIONNELLE"]
[null,"MOTIF de la DEMANDE:"]
[]
[null,"NOM de l' Association"]
[]
[null,"  Si \"Autre\" à préciser ICI : "]
{"$rows_left_out":39}
{"sheet":"2.2 budget Sub Except","index":10,"n_rows":60,"n_cols":9,"rows_kept":60,"cut":false,"hidden":false,"merged":[[59,7,59,8],[58,2,58,6],[59,4,59,6],[50,2,50,8],[0,0,0,8],[1,3,1,6],[2,2,2,3],[3,1,3,8],[2,4,2,6]]}
["2.2 - BUDGET PREVISIONNEL de la SUBVENTION EXCEPTIONNELLE"]
[null,null,"Association : ",null,null,null,null,2017]
[null,null,"Si \"Autre\" à préciser ICI :"]
[]
[null,"Code","CHARGES","Prévisionnel\nExcept ","Réalisé\nExcept","Code","PRODUITS","Prévisionnel\nExcept ","Réalisé\nExcept"]
[null,60,"Achats",{"$f":"SUM(D7:D12)","v":0},{"$f":"SUM(E7:E12)","v":0},70,"Ventes de produits et services",{"$f":"SUM(H7:H12)","v":0},{"$f":"SUM(I7:I12)","v":0}]
[null,6061,"Eau - Energies - EDF/GDF",null,{"$f":"SUMIFS(journal!$I$5:$I$986,journal!$K$5:$K$986,'2. Budget Général'!A7,journal!$O$5:$O$986,\"EXCEPT\")","v":0},701,"Ventes produits finis ",null,{"$f":"SUMIFS(journal!$J$5:$J$986,journal!$L$5:$L$986,'2. Budget Général'!F7,journal!$O$5:$O$986,\"EXCEPT\")","v":0}]
[null,6063,"Fournitures Ent. / Petit équipt ",null,{"$f":"SUMIFS(journal!$I$5:$I$986,journal!$K$5:$K$986,'2. Budget Général'!A8,journal!$O$5:$O$986,\"EXCEPT\")","v":0},706,"Prestations de services ",null,{"$f":"SUMIFS(journal!$J$5:$J$986,journal!$L$5:$L$986,'2. Budget Général'!F8,journal!$O$5:$O$986,\"EXCEPT\")","v":0}]
[null,6064,"Fournitures administratives",null,{"$f":"SUMIFS(journal!$I$5:$I$986,journal!$K$5:$K$986,'2. Budget Général'!A9,journal!$O$5:$O$986,\"EXCEPT\")","v":0},707,"Ventes de marchandises ",null,{"$f":"SUMIFS(journal!$J$5:$J$986,journal!$L$5:$L$986,'2. Budget Général'!F9,journal!$O$5:$O$986,\"EXCEPT\")","v":0}]
[null,607,"Achats marchandises ",null,{"$f":"SUMIFS(journal!$I$5:$I$986,journal!$K$5:$K$986,'2. Budget Général'!A10,journal!$O$5:$O$986,\"EXCEPT\")","v":0},708,"Produits des activités annexes ",null,{"$f":"SUMIFS(journal!$J$5:$J$986,journal!$L$5:$L$986,'2. Budget Général'!F10,journal!$O$5:$O$986,\"EXCEPT\")","v":0}]
{"$rows_left_out":51}
{"sheet":"3.2budget activité 3","index":11,"n_rows":60,"n_cols":7,"rows_kept":60,"cut":false,"hidden":false,"merged":[[0,3,0,5],[50,2,50,6],[58,6,59,6],[1,3,1,5],[2,3,2,5]]}
[]
[null,null,"Association : "]
[null,null,"NOM DE L'ACTIVITE:"]
[]
[null,"Code","CHARGES","Réalisé\nAction 3","Code","PRODUITS","Réalisé\nAction 3"]
[null,60,"Achats",{"$f":"SUM(D7:D12)","v":0},70,"Ventes de produits et services",{"$f":"SUM(G7:G12)","v":0}]
[null,6061,"Eau - Energies - EDF/GDF",{"$f":"SUMIFS(journal!$I$5:$I$986,journal!$K$5:$K$986,'2. Budget Général'!A7,journal!$O$5:$O$986,\"Activité 3\")","v":0},701,"Ventes produits finis ",{"$f":"SUMIFS(journal!$J$5:$J$986,journal!$L$5:$L$986,'2. Budget Général'!F7,journal!$O$5:$O$986,\"Activité 3\")","v":0}]
[null,6063,"Fournitures Ent. / Petit équipt ",{"$f":"SUMIFS(journal!$I$5:$I$986,journal!$K$5:$K$986,'2. Budget Général'!A8,journal!$O$5:$O$986,\"Activité 3\")","v":0},706,"Prestations de services ",{"$f":"SUMIFS(journal!$J$5:$J$986,journal!$L$5:$L$986,'2. Budget Général'!F8,journal!$O$5:$O$986,\"Activité 3\")","v":0}]
[null,6064,"Fournitures administratives",{"$f":"SUMIFS(journal!$I$5:$I$986,journal!$K$5:$K$986,'2. Budget Général'!A9,journal!$O$5:$O$986,\"Activité 3\")","v":0},707,"Ventes de marchandises ",{"$f":"SUMIFS(journal!$J$5:$J$986,journal!$L$5:$L$986,'2. Budget Général'!F9,journal!$O$5:$O$986,\"Activité 3\")","v":0}]
[null,607,"Achats marchandises ",{"$f":"SUMIFS(journal!$I$5:$I$986,journal!$K$5:$K$986,'2. Budget Général'!A10,journal!$O$5:$O$986,\"Activité 3\")","v":0},708,"Produits des activités annexes ",{"$f":"SUMIFS(journal!$J$5:$J$986,journal!$L$5:$L$986,'2. Budget Général'!F10,journal!$O$5:$O$986,\"Activité 3\")","v":0}]
{"$rows_left_out":51}
{"sheet":"4.2budget  activité 4","index":12,"n_rows":60,"n_cols":7,"rows_kept":60,"cut":false,"hidden":false,"merged":[[50,2,50,6],[58,6,59,6],[0,0,0,6],[1,3,1,5],[2,3,2,5]]}
[]
[null,null,"Association : "]
[null,null,"NOM DE L'ACTIVITE:"]
[]
[null,"Code","CHARGES","Réalisé\nAction 4","Code","PRODUITS","Réalisé\nAction 4"]
[null,60,"Achats",{"$f":"SUM(D7:D12)","v":0},70,"Ventes de produits et services",{"$f":"SUM(G7:G12)","v":0}]
[null,6061,"Eau - Energies - EDF/GDF",{"$f":"SUMIFS(journal!I5:I986,journal!K5:K986,'2. Budget Général'!A7,journal!O5:O986,\"Activité 4\")","v":0},701,"Ventes produits finis ",{"$f":"SUMIFS(journal!$J$5:$J$986,journal!$L$5:$L$986,'2. Budget Général'!F7,journal!$O$5:$O$986,\"Activité 4\")","v":0}]
[null,6063,"Fournitures Ent. / Petit équipt ",{"$f":"SUMIFS(journal!I6:I987,journal!K6:K987,'2. Budget Général'!A8,journal!O6:O987,\"Activité 4\")","v":0},706,"Prestations de services ",{"$f":"SUMIFS(journal!$J$5:$J$986,journal!$L$5:$L$986,'2. Budget Général'!F8,journal!$O$5:$O$986,\"Activité 4\")","v":0}]
[null,6064,"Fournitures administratives",{"$f":"SUMIFS(journal!I7:I988,journal!K7:K988,'2. Budget Général'!A9,journal!O7:O988,\"Activité 4\")","v":0},707,"Ventes de marchandises ",{"$f":"SUMIFS(journal!$J$5:$J$986,journal!$L$5:$L$986,'2. Budget Général'!F9,journal!$O$5:$O$986,\"Activité 4\")","v":0}]
[null,607,"Achats marchandises ",{"$f":"SUMIFS(journal!I8:I989,journal!K8:K989,'2. Budget Général'!A10,journal!O8:O989,\"Activité 4\")","v":0},708,"Produits des activités annexes ",{"$f":"SUMIFS(journal!$J$5:$J$986,journal!$L$5:$L$986,'2. Budget Général'!F10,journal!$O$5:$O$986,\"Activité 4\")","v":0}]
{"$rows_left_out":51}
{"sheet":"5.2budget activité 5","index":13,"n_rows":61,"n_cols":7,"rows_kept":61,"cut":false,"hidden":false,"merged":[[51,2,51,6],[59,6,60,6],[0,0,0,6],[1,3,1,5],[2,3,2,5]]}
[]
[null,null,"Association : "]
[null,null,"NOM DE L'ACTIVITE:"]
[]
[null,"Code","CHARGES","Réalisé\nAction 5","Code","PRODUITS","Réalisé\nAction 5"]
[null,60,"Achats",{"$f":"SUM(D7:D12)","v":0},70,"Ventes de produits et services",{"$f":"SUM(G7:G12)","v":0}]
[null,6061,"Eau - Energies - EDF/GDF",{"$f":"SUMIFS(journal!I5:I986,journal!K5:K986,'2. Budget Général'!A7,journal!O5:O986,\"Activité 5\")","v":0},701,"Ventes produits finis ",{"$f":"SUMIFS(journal!$J$5:$J$986,journal!$L$5:$L$986,'2. Budget Général'!F7,journal!$O$5:$O$986,\"Activité 5\")","v":0}]
[null,6063,"Fournitures Ent. / Petit équipt ",{"$f":"SUMIFS(journal!I6:I987,journal!K6:K987,'2. Budget Général'!A8,journal!O6:O987,\"Activité 5\")","v":0},706,"Prestations de services ",{"$f":"SUMIFS(journal!$J$5:$J$986,journal!$L$5:$L$986,'2. Budget Général'!F8,journal!$O$5:$O$986,\"Activité 5\")","v":0}]
[null,6064,"Fournitures administratives",{"$f":"SUMIFS(journal!I7:I988,journal!K7:K988,'2. Budget Général'!A9,journal!O7:O988,\"Activité 5\")","v":0},707,"Ventes de marchandises ",{"$f":"SUMIFS(journal!$J$5:$J$986,journal!$L$5:$L$986,'2. Budget Général'!F9,journal!$O$5:$O$986,\"Activité 5\")","v":0}]
[null,607,"Achats marchandises ",{"$f":"SUMIFS(journal!I8:I989,journal!K8:K989,'2. Budget Général'!A10,journal!O8:O989,\"Activité 5\")","v":0},708,"Produits des activités annexes ",{"$f":"SUMIFS(journal!$J$5:$J$986,journal!$L$5:$L$986,'2. Budget Général'!F10,journal!$O$5:$O$986,\"Activité 5\")","v":0}]
{"$rows_left_out":52}
{"sheet":"validation liste","index":14,"n_rows":104,"n_cols":27,"rows_kept":104,"cut":false,"hidden":false,"merged":[]}
[]
[]
[null,"theme",null,null,"public vise",null,"domaine","banque","tranche age",null,"commune",null,"NOMBRE","choix","nombres",null,"act","annee",null,"clubs",null,"oleroncom","charges",null,null,"produits"]
[]
[null,"Politique d'incitation à la venue dans le club",null,null,"Publics Hors Club",null,"Sportif","Compte N°1","Enfant - 18",null,"St Georges d'Oléron",null,0,"Non",1,null,"FONCT",2016,null,"ADANAC",null,"La Brée","I- Charges",null,null,"I- Ventes de produits et services"]
[null,"Ecole de Sport",null,null,"Personnes en difficultes Sociales",null,"Artistique","Compte N°2","Jeunes +18",null,"St Pierre d'Oléron",null,1,"Oui",2,null,"EXCEPT",2017,null,"AIKIDOLERON",null,"St Denis","Eau - Energies - EDF/GDF",6061,null,"Ventes produits finis",701]
[null,"Stage",null,null,"Bénévoles",null,"Culturel","Livret N°1","Seniors",null,"St Denis d'Oléron",null,2,null,3,null,"Activité 3",2018,null,"AIR MODELE CLUB",null,"St Georges","Fournitures Ent. et Petit équipt ",6063,null,"Prestations de services",706]
[null,"Création nouvelles Activites",null,null,"Personnes Handicapées",null,"Ecologique","Livret N°2","Tous Publics",null,"La Brée les Bains",null,3,null,4,null,"Activité 4",2019,null,"AMAO KARATE",null,"St Pierre","Fournitures administratives",6064,null,"Ventes de marchandises ",707]
[null,"Matériel Spécifique",null,null,"Licenciés, Adhérents du Club",null,"Formation","Caisse",null,null,"Dolus d'Oléron",null,4,null,5,null,"Activité 5",2020,null,"ATHLETISME OLERONAIS",null,"Dolus","Achats marchandises ",607,null,"Produits des activités annexes ",708]
[null,"Activités péri Scolaire",null,null,"Personnes Agées",null,"Animation","Contribution Volontaire",null,null,"Le Château d'Oléron",null,5,null,6,null,null,2021,null,"BILLARD OLERON",null,"Le Gd Village","Achats Matériel",608,null,null,{"$f":"'2. Budget Général'!F11","v":0}]
{"$rows_left_out":95}
{"sheet":"Feuil1","index":15,"n_rows":0,"n_cols":0,"rows_kept":0,"cut":false,"hidden":false,"merged":[]}